{"text_format":"1","workbook":"xlsx","n_sheets":9,"sheets":["Detention Profiles","DC Full Dataset","DC Map","Terms & Definitions","DC Methodology","Enumerator Guideline","DC Assessment Form","DC Location Info","index map"],"not_rendered":{"charts":0,"images":43,"macros":1,"external_links":0,"defined_names":26,"comments":0,"pivot_tables":0},"unopened":[],"bounds":{"document_bytes":16777216,"sheet_cells":100000,"rows_first":2000,"rows_last":500,"rows_between":2000,"halvings":0,"cell_chars":16384,"cell_head_chars":4096},"cells_cut":0,"cells_raw":0,"read":"whole","date_system":"1900"}

{"sheet":"Detention Profiles","index":0,"n_rows":69,"n_cols":15,"rows_kept":69,"cut":false,"hidden":false,"merged":[[58,6,58,10],[59,6,59,10],[39,6,39,10],[38,6,38,10],[40,6,40,10],[41,6,41,10],[43,6,43,10],[44,6,44,10],[45,6,45,10],[47,6,47,10],[48,6,48,10],[64,8,64,11],[67,0,67,11],[55,0,55,2],[54,0,54,11],[56,0,56,2],[57,0,57,11],[66,0,66,11],[68,0,68,11],[65,0,65,11],[55,3,55,5],[56,3,56,5],[58,3,58,5],[59,3,59,5],[63,0,63,1],[63,2,63,4],[63,5,63,7],[63,8,63,11],[61,0,61,11],[62,0,62,11],[58,0,58,2],[64,0,64,1],[64,2,64,4],[64,5,64,7],[56,6,56,10],[39,3,39,5],[40,3,40,5],[43,3,43,5],[44,3,44,5],[45,3,45,5],[60,3,60,5],[49,3,49,5],[60,6,60,11],[51,3,51,5],[52,3,52,5],[53,3,53,5],[50,0,50,11],[48,3,48,5],[59,0,59,2],[60,0,60,2],[49,0,49,2],[51,0,51,2],[52,0,52,2],[53,0,53,2],[48,0,48,2],[51,6,51,10],[52,6,52,10],[53,6,53,10],[55,6,55,10],[28,0,28,2],[30,0,30,3],[37,0,37,2],[38,0,38,2],[33,0,33,2],[31,0,31,2],[32,0,32,2],[34,0,34,11],[32,11,33,11],[33,3,33,4],[38,3,38,5],[27,9,27,11],[29,9,29,11],[29,0,29,2],[47,0,47,2],[42,0,42,11],[44,0,44,2],[45,0,45,2],[43,0,43,2],[46,0,46,11],[36,0,36,2],[36,3,36,5],[37,3,37,5],[47,3,47,5],[36,6,36,10],[37,6,37,10],[41,0,41,2],[39,0,39,2],[40,0,40,2],[41,3,41,5],[28,3,28,4],[29,3,29,4],[28,9,28,11],[31,3,31,4],[32,3,32,4],[0,0,2,11],[25,9,25,11],[26,9,26,11],[25,5,25,8],[26,5,26,8],[3,2,4,8],[24,0,24,11],[5,0,5,11],[22,0,22,11],[23,0,23,11],[16,8,16,11],[8,8,14,11],[17,9,17,11],[18,9,18,11],[19,9,19,11],[20,9,20,11],[21,9,21,11],[25,0,26,2],[25,3,26,4]]}
[]
[null,null,null,null,null,null,null,null,null,null,null,null,null,"December"]
[]
[null,null,"Abusliem"]
[]
[]
[]
[null,null,null,null,null,null,null,null,{"$f":"IF(ISBLANK(VLOOKUP($C$4,'DC Full Dataset'!$A:$B,2,0)),\"N/A\", VLOOKUP($C$4,'DC Full Dataset'!$A:$B,2,0))","v":"2021-12-26"},"How to Use:"]
[null,null,null,null,null,null,null,null,"1. To view each Detention Center Profile please select the name of center you want to view from the dropdown list. \n2. To see the full dataset go to \"DC Data\" tab.\n3. For a map of all Detention Centres please go to ‘DC Map’.\n4. For definition of terms go to \"Terms & Definitions\" tab.\n5. For Detention Centre Methodology go to ‘DC methodology’\n6. For enumerator guidelines and tools see ‘Enumerator guidelines’ and ‘Assessment form’."]
[]
[]
[]
[]
[]
[]
[]
[null,null,null,null,null,null,null,null,"Detention Center location"]
[null,null,null,null,null,null,null,null,"Muhalla",{"$f":"IF(ISBLANK(VLOOKUP($C$4,'DC Location Info'!$A:$B,2,0)),\"N/A\", VLOOKUP($C$4,'DC Location Info'!$A:$B,2,0))","v":"Abu Salim al janubi"}]
[null,null,null,null,null,null,null,null,"Baladiya",{"$f":"IF(ISBLANK(VLOOKUP($C$4,'DC Location Info'!$A:$C,3,0)),\"N/A\", VLOOKUP($C$4,'DC Location Info'!$A:$C,3,0))","v":"Abusliem"}]
[null,null,null,null,null,null,null,null,"Mantika",{"$f":"IF(ISBLANK(VLOOKUP($C$4,'DC Location Info'!$A:$D,4,0)),\"N/A\", VLOOKUP($C$4,'DC Location Info'!$A:$D,4,0))","v":"Tripoli"}]
{"$rows_left_out":50}
{"sheet":"DC Full Dataset","index":1,"n_rows":16,"n_cols":74,"rows_kept":16,"cut":false,"hidden":false,"merged":[]}
["Detention Centre Name (EN)","Date of Assesssment","Detention Centre Name (AR)",null,null,null,null,"Functioning registration system","Number of migrants on day of assessment","Are women & men separate","Are children & adults separate","Number male less 18 years of age","Number of male between 19-59","Number of male over 60","Number female less 18 years of age","Number of female between 19-59","Number of female over 60","Nationality most present in Detention Center","Number of detained from the most present nationality","Second most present nationality in Detention Center","Number of detained from the second most present nationality","Third most present nationality in Detention Center","Number of detained from the third most present nationality","Fourth most present nationality in Detention Center","Number of detained from the  fourth most present nationality","Fifth most present nationality in Detention Center","Number of detained from the fifth most present nationality","Number of individuals from remaining nationalities",null,"Number of breastfeeding women","Number of pregnant women","Are health services available at cente","How often are health services available","Is there a health clinic in the center?","Do detainees undergo health examination upon entry to facility?","What happens when a detainee is seriously ill or injured?","How often are medicines available in the center?","Is supplementary feeding available for pregnant / lactating mothers? ","Is supplementary feeding available for young children?","Did children fall ill during the last 30 days ","If MANY what is the primary reported illness?","Did adults fall ill during the last 30 days ","If MANY what is the primary reported illness?","Number of births in the past 30 days? ","If Yes, where did the pregnant ladies give birth? ","Do migrants have regular access to drinking water?","Are latrines functioning?","Are male and female separated latrines available? ","Are male and female separated bathing areas available?","Are sanitary hygiene kits available?","Are buckets available at site? ","Is there laundry facilities?","Does the DC provide daily food?","How often is food supplied  ","Who are the food distributions supported by?","Is there a private space where the detainees can talk to officials from international organizations / NGO?","Do migrants have access to legal services?","Do the majority of detainees have passports, identification card or other documents?","Are psychosocial support services available?","Is family-tracing available to migrants?","How much time do migrants spend outdoors during the day?","How much electrical and functioning ligthing is at the center?","Is the ventilation system working in the center?","How frequent are power cuts?","Do migrants have access to mobile phones?","Are migrants able to make international calls?","Do migrants have access to printed media?","Do migrants have access to television?","Do migrants have access to the internet?","Who did you collect the information for this assessment from? (KI 1)","KI2","KI3","KI4","DC Name No spaces"]
["Abusliem","2021-12-26","ابو سليم",null,null,null,null,"Yes",300,"Yes","No",95,205,0,0,0,0,"Eritrea",65,"GuineaBissau",50,"Nigeria",45,"Sudan",38,"Somalia",35,67,null,0,0,"Yes","Often (at least once a week)","No","Yes","Referred to the hospital","Irregularly (available every once in a while)","Never","Never","None",null,"Few",null,0,null,"Yes","Some","Yes","Yes","Yes","Yes","Yes","Yes","Three times a day","Government (DCIM)","Yes","Yes","No","Yes","Yes","Limited access to outdoors","A lot","Often","No power cuts","No","No","No","No","No","DCIM Detention centre manager","DCIM Detention centre staff member"]
["Ain Zara","2021-12-26","عين زارة",null,null,null,null,"No",800,"Yes","Yes",3,734,0,3,60,0,null,null,null,null,null,null,null,null,null,null,null,null,0,0,"Yes","Often (at least once a week)","Yes","No","Treated on site if/when a health staff comes","Irregularly (available every once in a while)","Never","Never","None",null,"Few",null,0,null,"Yes","All","Yes","Yes","Yes","Yes","No","Yes","Twice a day","Government (DCIM)","Yes","No","No","No","No","More than half a day","A lot","Irregulary","Occasional","No","No","Yes","No","No","DCIM Detention centre staff member"]
["Al Bayda","2021-12-26","البيضاء ",null,null,null,null,"Yes",29,"Yes","Yes",0,29,0,0,0,0,"Sudan",14,"Egypt",10,"Chad",5,null,null,null,null,null,null,0,0,"Yes","Often (at least once a week)","No","Yes","Treated on site if/when a health staff comes","Irregularly (available every once in a while)","Never","Never","None",null,"None",null,0,"Not applicable (no births)","Yes","All","Yes","Yes","Yes","Yes","Yes","Yes","Twice a day","Government (DCIM)","Yes","No","Yes","No","Yes","Less than half a day","A lot","Often","Occasional","Yes","No","No","No","No","DCIM Detention centre staff member"]
["Al kufra","2021-12-30","الكفرة الجوف",null,null,null,null,"Yes",0,"Yes","No",0,0,0,0,0,0,null,null,null,null,null,null,null,null,null,null,null,null,0,0,"Yes","Often (at least once a week)","Yes","Yes","Referred to the hospital","Regularly (available most of the time)","Never","Never","None",null,"None",null,0,"Not applicable (no births)","Yes","Some","Yes","Yes","No","No","No","Yes","Once a day","Government (DCIM)","No","No","Yes","Yes","No","More than half a day","Some","Often","Occasional","Yes","Yes","No","No","Yes","DCIM Detention centre manager"]
["Algatroun","2021-12-31","القطرون",null,null,null,null,"Yes",0,"Yes","No",0,0,0,0,0,0,null,null,null,null,null,null,null,null,null,null,null,null,0,0,"No",null,null,null,null,null,null,null,null,null,null,null,null,null,"No","Few","Yes","Yes","No","No","No","Yes","Once a day","NGO","Yes","No","Yes","No","No","They move freely between indoors and outdoors","Limited","No ventilation","Frequent","Yes","Yes","No","No","No","DCIM Detention centre manager"]
["Alqubba","2021-12-26","القبة",null,null,null,null,"Yes",45,"Yes","Yes",10,35,0,0,0,0,"Egypt",40,"Sudan",5,null,null,null,null,null,null,null,null,0,0,"Yes","Irregularly (once every few weeks","No","Yes","Treated on site if/when a health staff comes","Never","Never","Never","None",null,"Some",null,0,"Not applicable (no births)","Yes","All","Yes","Yes","Yes","Yes","Yes","No","Don’t know","Government (DCIM)","Yes","No","No","No","Yes","Limited access to outdoors","A lot","Irregulary","Frequent","No","No","No","No","No","DCIM Detention centre manager"]
["Baten Al Jabal","2021-12-26","باطن الجبل",null,null,null,null,"Yes",87,"Yes","No",null,null,null,null,null,null,null,null,null,null,null,null,null,null,null,null,null,null,0,0,"Yes","Often (at least once a week)","No","No","Treated on site if/when a health staff comes","Never","Never","Never","Few",null,"Few",null,0,"Not applicable (no births)","No","Some","No","No","No","Yes","No","Yes","Three times a day","Government (DCIM)","No","No","No","No","No","Don't know","Some","Often","Frequent","Don't Know","Don't Know","No","No","No","NGO worker active in detention centre"]
["Benghazi Ganfouda","2021-12-31","بنغازي قنفودة",null,null,null,null,"Yes",199,"Yes","Yes",4,150,30,3,11,1,"Sudan",32,"Chad",34,"Eritrea",24,"Bangladesh",24,"Egypt",29,56,null,0,0,"Yes","Often (at least once a week)","Yes","Yes","Referred to the hospital","Regularly (available most of the time)","Irregularly (available every once in a while)","Irregularly (available every once in a while)","Some",null,"Some",null,0,"At the hospital","Yes","Some","Yes","Yes","No","No","No","Yes","Three times a day","Government (DCIM)","Yes","Yes","Yes","Yes","Yes","Less than half a day","Some","No ventilation","Occasional","No","Yes","No","No","No","DCIM Detention centre staff member"]
["Ejdabia","2021-12-31","اجدابيا",null,null,null,null,"Yes",0,"No","No",0,0,0,0,0,0,null,null,null,null,null,null,null,null,null,null,null,null,0,0,"No",null,null,null,null,null,null,null,null,null,null,null,null,null,"Yes","All","No","No","No","No","No","No","Don’t know","Government (DCIM)","Yes","Yes","No","No","No","Limited access to outdoors","A lot","Often","Occasional","No","No","No","No","No","DCIM Detention centre manager","DCIM Detention centre staff member"]
["Ghiryan Aburshada","2021-12-26"," غريان أبو رشادة",null,null,null,null,"Yes",70,"No","Yes",0,70,0,0,0,0,"Sudan",30,"Mali",12,"Chad",11,"syria",8,"Ghana",3,6,null,0,0,"Yes","Often (at least once a week)","No","No","Treated on site if/when a health staff comes","Regularly (available most of the time)","Never","Never","None",null,"Few",null,0,"Not applicable (no births)","Yes","Few","No","No","Yes","Yes","No","Yes","Three times a day","Government (DCIM)","Yes","No","No","No","No","Limited access to outdoors","Some","Don't know","Frequent","No","Don't Know","No","No","No","DCIM Detention centre manager"]
["Shahhat","2021-12-26","شحات",null,null,null,null,"Yes",19,"Yes","Yes",0,19,0,0,0,0,"Egypt",16,"Chad",3,null,null,null,null,null,null,null,null,0,0,"Yes","Irregularly (once every few weeks","No","Yes","Treated on site if/when a health staff comes","Irregularly (available every once in a while)","Never","Never","None",null,"None",null,0,"Not applicable (no births)","Yes","All","Yes","Yes","Yes","Yes","Yes","Yes","Twice a day","Government (DCIM)","Yes","No","Yes","No","Yes","Less than half a day","A lot","Often","Occasional","Yes","No","No","No","No","DCIM Detention centre staff member"]
["Shara Zawya","2021-12-26","شارع الزاوية",null,null,null,null,"No",91,"Yes","No",20,0,0,11,59,1,"Eritrea",33,"Nigeria",18,"Somalia",17,"Sudan",9,"Ethiopia",9,5,null,8,3,"Yes","Often (at least once a week)","No","No","Referred to the hospital","Regularly (available most of the time)","Regularly (available most of the time)","Regularly (available most of the time)","Few",null,"Few",null,2,"At the hospital","No","Some","No","Yes","Yes","No","No","Yes","Twice a day","Government (DCIM)","No","No","No","No","No","They move freely between indoors and outdoors","Some","No ventilation","Occasional","No","No","No","No","No","DCIM Detention centre manager"]
["Tobruk","2021-12-31","طبرق",null,null,null,null,"Yes",10,"Yes","No",0,10,0,0,0,0,"Egypt",6,"Sudan",4,null,null,null,null,null,null,null,null,0,0,"No",null,null,null,null,null,null,null,null,null,null,null,null,null,"Yes","Few","Yes","Yes","No","No","No","Yes","Twice a day","Government (DCIM)","Yes","Yes","Yes","No","No","Less than half a day","Limited","No ventilation","Frequent","No","No","No","No","No","DCIM Detention centre manager","DCIM Detention centre staff member"]
["Triq al Sika","2021-12-26","طريق السكة",null,null,null,null,"Yes",752,"Yes","Yes",21,595,0,15,121,0,"Eritrea",198,"Somalia",107,"Sudan",91,"Niger",82,"CôtedIvoire",53,221,null,0,0,"Yes","Often (at least once a week)","Yes","Yes","Treated on site if/when a health staff comes","Regularly (available most of the time)","Irregularly (available every once in a while)","Irregularly (available every once in a while)","Few",null,"Some",null,0,"Not applicable (no births)","No","Some","Yes","Yes","Yes","Yes","No","Yes","Three times a day","Government (DCIM)","No","No","No","No","No","Don't know","A lot","No ventilation","Frequent","No","No","No","No","No","DCIM Detention centre manager"]
["Wadi Al Hai","2021-12-26","وادي الحي",null,null,null,null,"No",1600,"No","Yes",null,null,null,null,null,null,null,null,null,null,null,null,null,null,null,null,null,null,0,0,"Yes","Often (at least once a week)","No","No","Treated on site if/when a health staff comes","Irregularly (available every once in a while)","Never","Never","Some",null,"Many","Coughing/respiratory tract infection Fever",0,"Not applicable (no births)","No","Some","No","No","No","No","No","Yes","Three times a day","Government (DCIM)","No","Yes","No","No","No","Don't know","Some","Often","Frequent","Don't Know","Don't Know","No","No","No","DCIM Detention centre manager"]

{"sheet":"DC Map","index":2,"n_rows":0,"n_cols":0,"rows_kept":0,"cut":false,"hidden":false,"merged":[]}

{"sheet":"Terms & Definitions","index":3,"n_rows":63,"n_cols":1,"rows_kept":63,"cut":false,"hidden":false,"merged":[]}
["Glossary of Terms"]
["Official Detention Centre capacity: The maximum number of migrants the detention centre is able to contain."]
["Number of staff in detention centre: The total number of DCIM employees currently working in the detention centre."]
["Registration system: A system of gathering details from migrants when they enter the centre where the data is stored in a filing system or databse."]
["Number of migrants in detention: The total number of migrants in detention on the day of assessment. "]
["Unaccompanied or separated minors: Children who have been separated from both parents and other relatives and are not being cared for by any adult, who, by law or custom, is responsible for doing so."]
["Lactating women: Number of women who are currently breastfeeding in the detention centre"]
["Number of pregnant women: Number of women who are expecting a child currently in the detention centre."]
["Health services include any of the following: Clinic on site, referral to hospital, vaccinations, provision of medicines to migrants when required, supplementary feeding to mothers or to young children."]
[]
["Frequency of service provision"]
["·       Often: At least once a week"]
["·       Irregularly: Once every few weeks"]
["·       Don’t know: Please select if KI does not have the answer available."]
[]
["Regularity of medicine availability"]
["·       Regularly: Available for most days of the week"]
["·       Irregularly: Available for only some days of the week"]
["·       Not available: There is no access to it"]
["·       Don’t know: Please select if KI does not have the answer available."]
{"$rows_left_out":44}
{"sheet":"DC Methodology","index":4,"n_rows":52,"n_cols":1,"rows_kept":52,"cut":false,"hidden":false,"merged":[]}
["DTM Libya  - Detention Center Profiles Version: 1"]
["Methodology "]
["Displacement Tracking Matrix (DTM) │ International Organization for Migration (IOM)"]
[]
["What is Detention Centre Profiling?"]
["This document presents IOM Libya’s Detention Centre Profiling 2017 methodology. Part of IOM Libya’s Displacement Tracking Matrix (DTM) programme, Detention Centre Profiling has been implemented since May 2017 to monitor vulnerable populations in held in detention. "]
[]
["Detention Centre Profiling is component of IOM Libya’s Displacement Tracking Matrix programme. IOM’s DTM programme is a set of methods and tools that permits the development of a common narrative to complex situations. It establishes a regular and dynamic system to monitor the vulnerabilities of beneficiaries and deliver routine information packages on Libya’s displaced and migrant populations. "]
["IOM Libya’s Detention Centre Profiling component is a data orientated tool that routinely provides specific sex and age demographic data and key secotrial information on individuals held in Libya’s detention Centres. Detention Centre Profiling is targeted at providing specific quantitative data to humanitarian actors working on migration. IOM Libya’s Detention Centre Profiling component captures data from across all accessible detention Centres managed by Libya’s Department for Combatting Illegal Migration (DCIM)."]
["Detention Centre Profiling Populations of Concern:"]
[]
["IOM defines a migrant as any person who is moving or has moved across an international border or within a state away from his/her habitual place of residence, regardless of (1) the person’s legal status; (2) whether the movement is voluntary or involuntary; (3) what the causes for the movement are; or (4) what the length of the stay is. For DTM programmatic purposes in Libya, a migrant is considered any person present in Libya who does not possess Libyan nationality. As such, DTM does not differentiate between migrant statuses, length of residence in the country, or migratory intentions. It counts as migrants those who may have come from refugee producing countries, along with long-term residents and labour migrants who engage in a circular migration pattern between Libya and their countries of origin."]
[]
["Objective of Detention Centre Profiling "]
["Detention Centre Profiles aim to provide in-depth snapshots of detention centres under the management of Libya’s Directorate for Combatting Illegal Migration (DCIM) in Libya."]
["Modelled after the site assessments carried out by DTM in other contexts, such as South Sudan, these assessments gather information on the facilities of the centres in addition to the socio-demographic characteristics of migrants held in those centres."]
[]
[]
["DTM indicators for Detention Centre Profiles were selected following consultations with specific actors working in detention and drawn from consultative meetings with humanitarian partners on DTM’s Mobility Tracking component."]
["Each detention Centre assessed is selected based on accessibility. DTM’s expert assessments teams coordinate each assessment with IOM’s Assisted Voluntary Return and Repatriation (AVRR) and disembarkation support teams to ensure that IOM is providing a holistic approach to each of its interventions in a detention centre. "]
{"$rows_left_out":33}
{"sheet":"Enumerator Guideline","index":5,"n_rows":0,"n_cols":0,"rows_kept":0,"cut":false,"hidden":true,"merged":[]}

{"sheet":"DC Assessment Form","index":6,"n_rows":71,"n_cols":9,"rows_kept":71,"cut":false,"hidden":false,"merged":[[14,0,16,0],[14,1,16,1],[17,0,18,0],[17,1,18,1]]}
["Detention Centre Profile Assessment"]
["Indicator","Type of Input","Answer Choices"]
["Site Info"]
["Date of Assessment","Select from Calendar"]
["Detention centre Name","Dropdown list "]
["Enumerator Name","Input"]
[]
["Demographics"]
["What is the official capacity of this Detention Centre?","Input or selection","N#","Don't Know"]
["What is the official number of staff working at this Detention Centre?","Input or selection","N#","Don't Know"]
["Is there a functioning registration system in place?","Select one","Y/N"]
["How many migrants are in this centre today?\n","Input","N#"]
["Are women and men kept separately?","Select one","Y/N"]
["Are children and adults kept separately?","Select one","Y/N"]
["Out of the total number of migrants here, please provide the number of individuals in each category","Input",null,"0 – 18 years","19 - 59 years","> 60 years"]
[null,null,"Male","N#","N#","N#"]
[null,null,"Female","N#","N#","N#"]
["Select the top five nationalities present in Detention centre today and the number of migrants from each nationality.","Dropdown to select nationality then input to put number","Nationality","Nationality 1","Nationality 2","Nationality 3","Nationality 4","Nationality 5","All other nationalities"]
[null,null,"Number of migrants per nationality:","N#","N#","N#","N#","N#","N#"]
["Number of unaccompanied children in centre today","Input","N#"]
{"$rows_left_out":52}
{"sheet":"DC Location Info","index":7,"n_rows":65,"n_cols":7,"rows_kept":65,"cut":false,"hidden":true,"merged":[]}
["Detention centres EN ","Muhalla","Baladiya","Mantika","Geodivision","Detention centres AR","Name"]
["Abusliem","Abu Salim al janubi","Abusliem","Tripoli","West","ابو سليم","Abusliem"]
["Ain Zara","Ain zara","Ain Zara","Tripoli","West","عين زارة","Ain Zara"]
["Al Bayda","El Zawiyah El Kadima","Albayda","Al Jabal Al Akhdar","East","البيضاء 1"]
["Al Bayda 2","El Zawiyah El Kadima","Albayda","Al Jabal Al Akhdar","East","البيضاء 2"]
["Al kufra","Jawf markaz","Alkufra","Alkufra","East","الكفرة الجوف","Alkufra, Jawf"]
["Al Serraj","Janzour al sharkiyah","Azzintan","Al Jabal Al Gharbi","West","السراج"]
["Al Zintan","Al markaz /Azzintan","Azzintan","Al Jabal Al Gharbi","West","الزنتان"]
["Al Zintan",null,"Azzintan","Al Jabal Al Gharbi","West","الزنتان","Al Zintan"]
["Alabyar","Al radmani","Alabyar","Benghazi","East","الابيار"]
["Al-Fallah","Bab Assalam","Tripoli","Tripoli","West","الفلاح","Al Fallah"]
["Algatroun","Algatroun","Algatroun","Murzuq","South","القطرون","Al Gatroun"]
["Al-Guweia","Al  Guweia","Garabolli","Almargeb","West","القرة بولي","Al-Guweia"]
["Aljufra (Hun)","Hun El Janoubia","Aljufra","Aljufra","South","الجفرة","Aljufra (hun)"]
["Alkhums","Labda","Alkhums","Almargeb","West","الخمس","Alkhums"]
["Almarj","Al Marj El Charquia","Almarj","Almarj","East","المرج"]
["Alqubba","Koba El Chamalia","Alqubba","Derna","East","القبة"]
["AlSabaa","Ain Zara","Ain Zara","Tripoli","West","السبعة","AlSabaa"]
["Anjila","Janzour al wasat","Janzour","Aljfara","West","انجيلة"]
["Anjila","Janzour al wasat","Janoub Azzawya","Azzawya","West","انجيلة"]
{"$rows_left_out":46}
{"sheet":"index map","index":8,"n_rows":34,"n_cols":1,"rows_kept":34,"cut":false,"hidden":true,"merged":[]}
[]
["Abusliem"]
["Suq Alkhamees"]
["Mabani"]
["Azzawya Abu Issa"]
["Benghazi Al Wafiah"]
["Ghiryan al Hamra"]
["Ghiryan Aburshada"]
["Sabratha Melita"]
["Salah Aldin"]
["Shahhat"]
["Algatroun"]
["Daraj"]
["Alqubba"]
["Tobruk"]
["Toukra"]
["Trig Al Matar"]
["Triq al Sika"]
["Trig al Shook "]
["Zwara"]
{"$rows_left_out":14}